{"text_format":"1","workbook":"xlsx","n_sheets":11,"sheets":["1 Title Page","2 BUDGET SUMMARY","3 Staffing-Employee & Contract","4 Program Expenses","5 Travel","6 Admin-Space-Misc","Staff Admin & Pgm","Statement of Work","Admin Costs","PSE Costs","Review Summary"],"not_rendered":{"charts":0,"images":1,"macros":1,"external_links":0,"defined_names":36,"comments":2,"pivot_tables":0},"unopened":[],"bounds":{"document_bytes":16777216,"sheet_cells":100000,"rows_first":2000,"rows_last":500,"rows_between":2000,"halvings":0,"cell_chars":16384,"cell_head_chars":4096},"cells_cut":0,"cells_raw":0,"read":"whole","date_system":"1900"}

{"sheet":"1 Title Page","index":0,"n_rows":25,"n_cols":12,"rows_kept":25,"cut":false,"hidden":false,"merged":[[32,11,34,14],[36,11,53,14],[55,11,55,14],[10,0,10,10],[16,0,16,10],[26,0,26,10],[8,0,8,10],[14,0,14,10],[11,0,11,10],[23,0,23,10],[25,0,25,10],[20,0,20,10],[15,0,15,10],[19,0,19,10],[24,0,24,10]]}
[null,null,null,null,null,null,null,null,null,null,null,2023]
[]
[]
[]
[]
[]
[]
[]
["Budget Worksheets"]
[]
{"$rows_left_out":16}
{"sheet":"2 BUDGET SUMMARY","index":1,"n_rows":124,"n_cols":6,"rows_kept":124,"cut":false,"hidden":false,"merged":[[80,2,80,4],[81,2,81,4],[82,2,82,4],[83,2,83,4],[84,2,84,4],[85,2,85,4],[114,2,114,4],[78,1,78,4],[79,2,79,4],[110,2,110,4],[107,1,107,4],[111,2,111,4],[90,2,90,4],[123,1,123,4],[108,2,108,4],[58,2,58,4],[59,2,59,4],[55,2,55,4],[56,2,56,4],[57,2,57,4],[76,2,76,4],[60,2,60,4],[61,2,61,4],[62,2,62,4],[64,2,64,4],[75,2,75,4],[69,2,69,4],[70,2,70,4],[71,2,71,4],[72,2,72,4],[112,2,112,4],[113,2,113,4],[117,2,117,4],[65,2,65,4],[66,2,66,4],[120,1,120,2],[109,2,109,4],[115,2,115,4],[116,2,116,4],[118,1,118,4],[119,1,119,4],[106,2,106,4],[86,2,86,4],[87,2,87,4],[91,2,91,4],[92,2,92,4],[102,2,102,4],[103,2,103,4],[104,1,104,4],[105,2,105,4],[96,2,96,4],[97,2,97,4],[98,2,98,4],[99,2,99,4],[100,2,100,4],[101,2,101,4],[94,2,94,4],[95,2,95,4],[93,2,93,4],[88,2,88,4],[89,2,89,4],[40,2,40,4],[31,2,31,4],[32,2,32,4],[67,2,67,4],[68,2,68,4],[77,2,77,4],[73,2,73,4],[74,2,74,4],[63,2,63,4],[53,2,53,4],[54,2,54,4],[42,1,42,4],[43,2,43,4],[44,2,44,4],[47,2,47,4],[48,2,48,4],[39,2,39,4],[121,1,121,2],[121,3,121,4],[122,1,122,4],[0,1,0,5],[1,1,1,5],[2,1,2,5],[3,1,3,5],[4,1,4,5],[41,2,41,4],[45,2,45,4],[50,2,50,4],[51,2,51,4],[52,2,52,4],[24,2,24,4],[25,2,25,4],[16,2,16,4],[17,2,17,4],[18,2,18,4],[29,2,29,4],[30,2,30,4],[21,2,21,4],[22,2,22,4],[23,2,23,4],[34,2,34,4],[6,1,6,4],[5,1,5,5],[46,2,46,4],[49,2,49,4],[9,2,9,4],[10,2,10,4],[14,2,14,4],[15,2,15,4],[7,2,7,4],[8,2,8,4],[19,2,19,4],[20,2,20,4],[11,2,11,4],[12,2,12,4],[13,2,13,4],[33,2,33,4],[36,2,36,4],[37,2,37,4],[38,2,38,4],[35,2,35,4],[26,2,26,4],[27,2,27,4],[28,2,28,4]]}
["FILTER",{"$f":"'1 Title Page'!A20","v":"[Organization Name]"}]
["Y",{"$f":"\"FY\"&'1 Title Page'!L1&\" SNAP-Ed Budget Summary\"","v":"FY2023 SNAP-Ed Budget Summary"}]
["Y"]
["Y","This worksheet populates automatically when data is entered on subsequent tabs."]
["Y"]
["Y","SNAP-Ed Grant Award (CFDA #10.561)"]
["Y","Salary and Fringe",null,null,null,{"$f":"SUM(F8:F42)","v":0}]
[{"$f":"IF(C8<>\"\",\"Y\",IF(F8<>0,\"Y\",\"N\"))","v":"N"},{"$f":"'3 Staffing-Employee & Contract'!B7","v":1},{"$f":"IF(VLOOKUP($B8,'3 Staffing-Employee & Contract'!$B$7:$R$41,2,FALSE)<>\"\",VLOOKUP($B8,'3 Staffing-Employee & Contract'!$B$7:$R$41,2,FALSE),\"\")","v":""},null,null,{"$f":"IF(VLOOKUP($B8,'3 Staffing-Employee & Contract'!$B$7:$R$41,17,FALSE)<>\"\",VLOOKUP($B8,'3 Staffing-Employee & Contract'!$B$7:$R$41,17,FALSE),\"\")","v":0}]
["N",{"$f":"'3 Staffing-Employee & Contract'!B8","v":2},{"$f":"IF(VLOOKUP($B9,'3 Staffing-Employee & Contract'!$B$7:$R$41,2,FALSE)<>\"\",VLOOKUP($B9,'3 Staffing-Employee & Contract'!$B$7:$R$41,2,FALSE),\"\")","v":""},null,null,{"$f":"IF(VLOOKUP($B9,'3 Staffing-Employee & Contract'!$B$7:$R$41,17,FALSE)<>\"\",VLOOKUP($B9,'3 Staffing-Employee & Contract'!$B$7:$R$41,17,FALSE),\"\")","v":0}]
["N",{"$f":"'3 Staffing-Employee & Contract'!B9","v":3},{"$f":"IF(VLOOKUP($B10,'3 Staffing-Employee & Contract'!$B$7:$R$41,2,FALSE)<>\"\",VLOOKUP($B10,'3 Staffing-Employee & Contract'!$B$7:$R$41,2,FALSE),\"\")","v":""},null,null,{"$f":"IF(VLOOKUP($B10,'3 Staffing-Employee & Contract'!$B$7:$R$41,17,FALSE)<>\"\",VLOOKUP($B10,'3 Staffing-Employee & Contract'!$B$7:$R$41,17,FALSE),\"\")","v":0}]
{"$rows_left_out":115}
{"sheet":"3 Staffing-Employee & Contract","index":2,"n_rows":81,"n_cols":32,"rows_kept":81,"cut":false,"hidden":false,"merged":[[80,8,80,14],[5,12,5,14],[43,12,43,14],[0,1,1,7],[0,8,0,18],[1,8,1,18],[2,1,2,16],[2,17,2,18],[3,1,3,18],[42,8,42,14]]}
["FILTER",{"$f":"'1 Title Page'!A20","v":"[Organization Name]"},null,null,null,null,null,null,{"$f":"\"SNAP-Ed FY\"&'1 Title Page'!L1","v":"SNAP-Ed FY2023"}]
["Y",null,null,null,null,null,null,null,"Grant Staffing - Employees & Contracted Staff"]
["Y",null,null,null,null,null,null,null,null,null,null,null,null,null,null,null,null,{"$f":"TODAY()","v":44619}]
["Y"]
["Y",null,"Name","Title","Description of SNAP-Ed Duties",null,"Total Annual Salary","Fringe Rate (%)","Annual Fringe","Annual Salary/Fringe TOTAL","Annual Organization FTE","FTE Reimbursed by SNAP-Ed (%)","% Time spent on SNAP-Ed program admin","% Time spent on SNAP-Ed PSE","% Time spent on SNAP-Ed direct education","FTE commitment to SNAP-Ed","# of Weekly SNAP-Ed Hours","Annual Salary & Fringe\nReimbursed by SNAP-Ed",null,null,null,"$ on Admin","$ on PSE","Need to hide Columns V-W before saving",null,null,null,null,null,"Name not blank","Amount not blank","Key cells not blank"]
["Y",null,"EMPLOYEES",null,null,null,null,null,null,null,null,null,"MUST total 100% per employee"]
[{"$f":"IF(AF7<>0,\"Y\",\"N\")","v":"N"},{"$f":"IF(SUM(AF8:AF$42)>0,IF(AF7=1,MAX(B$6:B6)+AF7,IF(SUM(AF$6:AF$42)>0,0,MAX(B$6:B6)+1)),MAX(B$6:B6)+1)","v":1},null,null,null,null,null,null,{"$f":"ROUND(G7*H7,0)","v":0},{"$f":"G7+I7","v":0},null,null,null,null,null,{"$f":"ROUND(K7*L7,3)","v":0},{"$f":"ROUND((K7*2080)*L7/52,1)","v":0},{"$f":"ROUND(J7*L7,0)","v":0},null,null,null,{"$f":"ROUND($R7*M7,0)","v":0},{"$f":"ROUND($R7*N7,0)","v":0},null,null,null,null,null,null,{"$f":"IF(C7<>\"\",1,0)","v":0},{"$f":"IF(R7<>0,1,0)","v":0},{"$f":"IF(SUM(AD7:AE7)>0,1,0)","v":0}]
[{"$f":"IF(AF8<>0,\"Y\",\"N\")","v":"N"},{"$f":"IF(SUM(AF9:AF$42)>0,IF(AF8=1,MAX(B$6:B7)+AF8,IF(SUM(AF$6:AF$42)>0,0,MAX(B$6:B7)+1)),MAX(B$6:B7)+1)","v":2},null,null,null,null,null,null,{"$f":"ROUND(G8*H8,0)","v":0},0,null,null,null,null,null,0,0,0,null,null,null,{"$f":"ROUND($R8*M8,0)","v":0},{"$f":"ROUND($R8*N8,0)","v":0},null,null,null,null,null,null,{"$f":"IF(C8<>\"\",1,0)","v":0},0,0]
[{"$f":"IF(AF9<>0,\"Y\",\"N\")","v":"N"},{"$f":"IF(SUM(AF10:AF$42)>0,IF(AF9=1,MAX(B$6:B8)+AF9,IF(SUM(AF$6:AF$42)>0,0,MAX(B$6:B8)+1)),MAX(B$6:B8)+1)","v":3},null,null,null,null,null,null,0,0,null,null,null,null,null,0,0,0,null,null,null,0,0,null,null,null,null,null,null,0,0,0]
["N",{"$f":"IF(SUM(AF11:AF$42)>0,IF(AF10=1,MAX(B$6:B9)+AF10,IF(SUM(AF$6:AF$42)>0,0,MAX(B$6:B9)+1)),MAX(B$6:B9)+1)","v":4},null,null,null,null,null,null,0,0,null,null,null,null,null,0,0,0,null,null,null,0,0,null,null,null,null,null,null,0,0,0]
{"$rows_left_out":72}
{"sheet":"4 Program Expenses","index":3,"n_rows":32,"n_cols":19,"rows_kept":32,"cut":false,"hidden":false,"merged":[[16,4,16,5],[3,1,3,5],[0,18,4,18],[25,4,25,5],[0,16,4,16],[23,4,23,5],[0,17,4,17],[5,4,5,5],[6,4,6,5],[4,4,4,5],[0,1,2,4],[0,5,0,6],[1,5,1,6],[2,5,2,6],[19,4,19,5],[17,4,17,5],[7,4,7,5],[20,4,20,5],[29,4,29,5],[8,4,8,5],[9,4,9,5],[10,4,10,5],[11,4,11,5],[21,4,21,5],[26,4,26,5],[27,4,27,5],[22,4,22,5],[24,4,24,5],[12,4,12,5],[13,4,13,5],[14,4,14,5],[15,4,15,5],[28,4,28,5],[18,4,18,5]]}
["FILTER",{"$f":"'1 Title Page'!A20","v":"[Organization Name]"},null,null,null,{"$f":"\"SNAP-Ed FY\"&'1 Title Page'!L1","v":"SNAP-Ed FY2023"},null,null,null,null,null,null,null,null,null,null,"Expense not blank","Amount not blank","Key cells not blank"]
["Y",null,null,null,null,"Program Expenses"]
["Y"]
["Y",{"$f":"IF((SUM(Q8:Q31)+SUM(R8:R31))>0,\"\",\"*Include expenses for supplies/materials and programming-related contracts here\")","v":"*Include expenses for supplies/materials and programming-related contracts here"},null,null,null,null,{"$f":"TODAY()","v":44619}]
["Y",null,"Expense","% Related to PSE","Description and Purpose",null,"Amount",null,null,null,null,null,null,null,"PSE Expense"]
[{"$f":"IF(C6<>0,\"Y\",IF(G6<>0,\"Y\",\"N\"))","v":"Y"},{"$f":"IF(SUM(S7:S$31)>0,IF(S6=1,MAX(B$5:B5)+S6,IF(SUM(S$5:S$31)>0,0,MAX(B$5:B5)+1)),MAX(B$5:B5)+1)","v":1},"Postage",null,null,null,null,null,null,null,null,null,null,null,{"$f":"ROUND(D6*G6,0)","v":0},null,{"$f":"IF(C6<>\"\",1,0)","v":1},{"$f":"IF(G6<>0,1,0)","v":0},{"$f":"IF(SUM(Q6:R6)>0,1,0)","v":1}]
["N",{"$f":"IF(SUM(S8:S$31)>0,IF(S7=1,MAX(B$5:B6)+S7,IF(SUM(S$5:S$31)>0,0,MAX(B$5:B6)+1)),MAX(B$5:B6)+1)","v":2},null,null,null,null,null,null,null,null,null,null,null,null,{"$f":"ROUND(D7*G7,0)","v":0},null,0,0,{"$f":"IF(SUM(Q7:R7)>0,1,0)","v":0}]
[{"$f":"IF(C8<>0,\"Y\",IF(G8<>0,\"Y\",\"N\"))","v":"N"},{"$f":"IF(SUM(S9:S$31)>0,IF(S8=1,MAX(B$5:B7)+S8,IF(SUM(S$5:S$31)>0,0,MAX(B$5:B7)+1)),MAX(B$5:B7)+1)","v":3},null,null,null,null,null,null,null,null,null,null,null,null,{"$f":"ROUND(D8*G8,0)","v":0},null,0,0,{"$f":"IF(SUM(Q8:R8)>0,1,0)","v":0}]
["N",{"$f":"IF(SUM(S10:S$31)>0,IF(S9=1,MAX(B$5:B8)+S9,IF(SUM(S$5:S$31)>0,0,MAX(B$5:B8)+1)),MAX(B$5:B8)+1)","v":4},null,null,null,null,null,null,null,null,null,null,null,null,0,null,0,0,0]
["N",{"$f":"IF(SUM(S11:S$31)>0,IF(S10=1,MAX(B$5:B9)+S10,IF(SUM(S$5:S$31)>0,0,MAX(B$5:B9)+1)),MAX(B$5:B9)+1)","v":5},null,null,null,null,null,null,null,null,null,null,null,null,0,null,0,0,0]
{"$rows_left_out":23}
{"sheet":"5 Travel","index":4,"n_rows":40,"n_cols":30,"rows_kept":40,"cut":false,"hidden":false,"merged":[[4,29,6,29],[33,1,33,3],[4,1,4,18],[32,1,32,3],[5,1,6,6],[7,1,7,6],[8,1,8,6],[9,1,9,6],[28,1,28,3],[29,1,29,3],[22,1,22,18],[27,1,27,3],[21,1,21,7],[30,1,30,3],[23,1,23,18],[24,1,24,7],[24,8,24,10],[24,11,24,13],[24,14,24,16],[24,17,25,17],[25,1,25,3],[26,1,26,3],[39,1,39,17],[38,1,38,18],[37,1,37,7],[36,1,36,3],[31,1,31,3],[35,1,35,3],[34,1,34,3],[10,1,10,6],[5,7,6,7],[0,1,2,10],[2,11,2,18],[0,11,0,18],[1,11,1,18],[5,17,6,17],[5,8,5,10],[5,11,5,13],[5,14,5,16],[3,1,3,18]]}
["FILTER",{"$f":"'1 Title Page'!A20","v":"[Organization Name]"},null,null,null,null,null,null,null,null,null,{"$f":"\"SNAP-Ed FY\"&'1 Title Page'!L1","v":"SNAP-Ed FY2023"}]
["Y",null,null,null,null,null,null,null,null,null,null,"Travel"]
["Y"]
["Y",{"$f":"TODAY()","v":44619},null,null,null,null,null,null,null,null,null,null,null,null,null,null,null,null,null,null,null,null,null,"PSE Expense"]
["Y","Local Program Travel",null,null,null,null,null,null,null,null,null,null,null,null,null,null,null,null,null,null,null,null,null,null,null,null,null,null,null,"Reg fee, meal days, per diem, lodging days, lodging rate - no # attending"]
["Y","Purpose of Travel",null,null,null,null,null,"% Related to PSE","Mileage",null,null,"Meals",null,null,"Lodging",null,null,"Other: tolls, tips, etc."]
["Y",null,null,null,null,null,null,null,"# of Miles","Mileage Rate","Mileage Subtotal","# of Days","Per Diem","Meal Subtotal","# of Nights","Rate","Lodging Subtotal",null,"Total",null,null,null,null,null,null,"Conf, no city/state","Conf attend, no reg fee","Meal days, no per diem","Lodging days, no rate"]
["Y","Local Program Travel",null,null,null,null,null,null,null,0.58499999999999996,{"$f":"ROUND(I8*J8,0)","v":0},null,null,{"$f":"ROUND(L8*M8,0)","v":0},null,85,{"$f":"ROUND(O8*P8,0)","v":0},null,{"$f":"K8+N8+Q8+R8","v":0},null,null,null,null,{"$f":"ROUND(H8*S8,0)","v":0},null,null,null,{"$f":"IF(L8<>0,IF(M8=0,\"y\",\"n\"),\"n\")","v":"n"}]
[{"$f":"IF(B9<>0,\"Y\",IF(S9<>0,\"Y\",\"N\"))","v":"N"},null,null,null,null,null,null,null,null,0.58499999999999996,0,null,null,0,null,85,0,null,0,null,null,null,null,{"$f":"ROUND(H9*S9,0)","v":0},null,null,null,"n"]
["N",null,null,null,null,null,null,null,null,0.58499999999999996,0,null,null,0,null,85,0,null,0,null,null,null,null,0,null,null,null,"n"]
{"$rows_left_out":31}
{"sheet":"6 Admin-Space-Misc","index":5,"n_rows":17,"n_cols":19,"rows_kept":17,"cut":false,"hidden":false,"merged":[[0,16,4,16],[0,17,4,17],[0,18,4,18],[4,4,4,5],[12,4,12,5],[0,5,0,6],[1,5,1,6],[2,5,2,6],[3,1,3,6],[5,4,5,5],[0,1,2,4],[13,4,13,5],[14,4,14,5],[10,4,10,5],[11,4,11,5],[6,4,6,5],[7,4,7,5],[8,4,8,5],[9,4,9,5]]}
["FILTER",{"$f":"'1 Title Page'!A20","v":"[Organization Name]"},null,null,null,{"$f":"\"SNAP-Ed FY\"&'1 Title Page'!L1","v":"SNAP-Ed FY2023"},null,null,null,null,null,null,null,null,null,null,"Expense not blank","Amount not blank","Key cells not blank"]
["Y",null,null,null,null,"Administrative / Space / Miscellaneous"]
["Y"]
["Y",{"$f":"TODAY()","v":44619}]
["Y",null,"Expense","% Related to PSE","Description and Purpose",null,"Amount",null,null,null,null,null,null,null,"PSE Expense"]
["Y",{"$f":"IF(SUM(S7:S$31)>0,IF(S6=1,MAX(B$5:B5)+S6,IF(SUM(S$5:S$31)>0,0,MAX(B$5:B5)+1)),MAX(B$5:B5)+1)","v":1},null,null,null,null,null,null,null,null,null,null,null,null,{"$f":"ROUND(D6*G6,0)","v":0},null,{"$f":"IF(C6<>\"\",1,0)","v":0},{"$f":"IF(G6<>0,1,0)","v":0},{"$f":"IF(SUM(Q6:R6)>0,1,0)","v":0}]
[{"$f":"IF(C7<>0,\"Y\",IF(G7<>0,\"Y\",\"N\"))","v":"N"},{"$f":"IF(SUM(S8:S$31)>0,IF(S7=1,MAX(B$5:B6)+S7,IF(SUM(S$5:S$31)>0,0,MAX(B$5:B6)+1)),MAX(B$5:B6)+1)","v":2},null,null,null,null,null,null,null,null,null,null,null,null,{"$f":"ROUND(D7*G7,0)","v":0},null,{"$f":"IF(C7<>\"\",1,0)","v":0},{"$f":"IF(G7<>0,1,0)","v":0},0]
["N",{"$f":"IF(SUM(S9:S$31)>0,IF(S8=1,MAX(B$5:B7)+S8,IF(SUM(S$5:S$31)>0,0,MAX(B$5:B7)+1)),MAX(B$5:B7)+1)","v":3},null,null,null,null,null,null,null,null,null,null,null,null,0,null,{"$f":"IF(C8<>\"\",1,0)","v":0},{"$f":"IF(G8<>0,1,0)","v":0},0]
["N",{"$f":"IF(SUM(S10:S$31)>0,IF(S9=1,MAX(B$5:B8)+S9,IF(SUM(S$5:S$31)>0,0,MAX(B$5:B8)+1)),MAX(B$5:B8)+1)","v":4},null,null,null,null,null,null,null,null,null,null,null,null,0,null,0,0,0]
["N",{"$f":"IF(SUM(S11:S$31)>0,IF(S10=1,MAX(B$5:B9)+S10,IF(SUM(S$5:S$31)>0,0,MAX(B$5:B9)+1)),MAX(B$5:B9)+1)","v":5},null,null,null,null,null,null,null,null,null,null,null,null,0,null,0,0,0]
{"$rows_left_out":8}
{"sheet":"Staff Admin & Pgm","index":6,"n_rows":80,"n_cols":8,"rows_kept":80,"cut":false,"hidden":false,"merged":[[4,7,5,7],[0,1,2,2],[0,3,0,7],[1,3,1,7],[2,3,2,7],[3,1,3,7],[4,2,5,2],[4,3,5,3],[4,4,4,6]]}
["FILTER",{"$f":"'1 Title Page'!A20","v":"[Organization Name]"},null,{"$f":"\"SNAP-Ed FY\"&'1 Title Page'!L1","v":"SNAP-Ed FY2023"}]
["Y",null,null,"Staffing & Admin or Program Delivery"]
["Y"]
["Y",{"$f":"TODAY()","v":44619}]
["Y",null,"Position Title","FTE's Committed to SNAP-Ed","Description of Job Duties",null,null,"Total SNAP-Ed Salary, Benefits & Wages"]
["Y",null,null,null,"% SNAP-Ed Time Spent on Program Admin","% SNAP-Ed Time Spent on PSE","% SNAP-Ed Time Spent on Direct Ed"]
["Y",null,"EMPLOYEES"]
[{"$f":"IF(C8<>\"\",\"Y\",IF(H8<0.1,\"Y\",\"N\"))","v":"N"},{"$f":"'3 Staffing-Employee & Contract'!B7","v":1},{"$f":"IF('3 Staffing-Employee & Contract'!$D7<>0,'3 Staffing-Employee & Contract'!D7,\"\")","v":""},{"$f":"IF('3 Staffing-Employee & Contract'!$D7<>0,'3 Staffing-Employee & Contract'!P7,\" \")","v":" "},{"$f":"IF('3 Staffing-Employee & Contract'!$D7<>0,'3 Staffing-Employee & Contract'!M7,\" \")","v":" "},{"$f":"IF('3 Staffing-Employee & Contract'!$D7<>0,'3 Staffing-Employee & Contract'!N7,\" \")","v":" "},{"$f":"IF('3 Staffing-Employee & Contract'!$D7<>0,'3 Staffing-Employee & Contract'!O7,\" \")","v":" "},{"$f":"IF('3 Staffing-Employee & Contract'!$D7<>0,'3 Staffing-Employee & Contract'!R7,\" \")","v":" "}]
["N",{"$f":"'3 Staffing-Employee & Contract'!B8","v":2},{"$f":"IF('3 Staffing-Employee & Contract'!$D8<>0,'3 Staffing-Employee & Contract'!D8,\"\")","v":""},{"$f":"IF('3 Staffing-Employee & Contract'!$D8<>0,'3 Staffing-Employee & Contract'!P8,\" \")","v":" "},{"$f":"IF('3 Staffing-Employee & Contract'!$D8<>0,'3 Staffing-Employee & Contract'!M8,\" \")","v":" "},{"$f":"IF('3 Staffing-Employee & Contract'!$D8<>0,'3 Staffing-Employee & Contract'!N8,\" \")","v":" "},{"$f":"IF('3 Staffing-Employee & Contract'!$D8<>0,'3 Staffing-Employee & Contract'!O8,\" \")","v":" "},{"$f":"IF('3 Staffing-Employee & Contract'!$D8<>0,'3 Staffing-Employee & Contract'!R8,\" \")","v":" "}]
["N",{"$f":"'3 Staffing-Employee & Contract'!B9","v":3},{"$f":"IF('3 Staffing-Employee & Contract'!$D9<>0,'3 Staffing-Employee & Contract'!D9,\"\")","v":""},{"$f":"IF('3 Staffing-Employee & Contract'!$D9<>0,'3 Staffing-Employee & Contract'!P9,\" \")","v":" "},{"$f":"IF('3 Staffing-Employee & Contract'!$D9<>0,'3 Staffing-Employee & Contract'!M9,\" \")","v":" "},{"$f":"IF('3 Staffing-Employee & Contract'!$D9<>0,'3 Staffing-Employee & Contract'!N9,\" \")","v":" "},{"$f":"IF('3 Staffing-Employee & Contract'!$D9<>0,'3 Staffing-Employee & Contract'!O9,\" \")","v":" "},{"$f":"IF('3 Staffing-Employee & Contract'!$D9<>0,'3 Staffing-Employee & Contract'!R9,\" \")","v":" "}]
{"$rows_left_out":71}
{"sheet":"Statement of Work","index":7,"n_rows":77,"n_cols":5,"rows_kept":77,"cut":false,"hidden":false,"merged":[[0,1,2,3],[3,1,3,4]]}
["FILTER",{"$f":"'1 Title Page'!A20","v":"[Organization Name]"},null,null,{"$f":"\"SNAP-Ed FY\"&'1 Title Page'!L1","v":"SNAP-Ed FY2023"}]
["Y",null,null,null,"Statement of Work"]
["Y"]
["Y",{"$f":"TODAY()","v":44619}]
["Y",null,"Job Title","Number of Hours/Week","SNAP-Ed Job Duties"]
["Y",null,"EMPLOYEES"]
[{"$f":"IF(C7<>\"\",\"Y\",\"N\")","v":"N"},{"$f":"'3 Staffing-Employee & Contract'!B7","v":1},{"$f":"IF('3 Staffing-Employee & Contract'!D7<>0,'3 Staffing-Employee & Contract'!D7,\"\")","v":""},{"$f":"IF('3 Staffing-Employee & Contract'!Q7<>0,'3 Staffing-Employee & Contract'!Q7,\"\")","v":""},{"$f":"IF('3 Staffing-Employee & Contract'!E7<>0,'3 Staffing-Employee & Contract'!E7,\"\")","v":""}]
["N",{"$f":"'3 Staffing-Employee & Contract'!B8","v":2},{"$f":"IF('3 Staffing-Employee & Contract'!D8<>0,'3 Staffing-Employee & Contract'!D8,\"\")","v":""},{"$f":"IF('3 Staffing-Employee & Contract'!Q8<>0,'3 Staffing-Employee & Contract'!Q8,\"\")","v":""},{"$f":"IF('3 Staffing-Employee & Contract'!E8<>0,'3 Staffing-Employee & Contract'!E8,\"\")","v":""}]
["N",{"$f":"'3 Staffing-Employee & Contract'!B9","v":3},{"$f":"IF('3 Staffing-Employee & Contract'!D9<>0,'3 Staffing-Employee & Contract'!D9,\"\")","v":""},{"$f":"IF('3 Staffing-Employee & Contract'!Q9<>0,'3 Staffing-Employee & Contract'!Q9,\"\")","v":""},{"$f":"IF('3 Staffing-Employee & Contract'!E9<>0,'3 Staffing-Employee & Contract'!E9,\"\")","v":""}]
["N",{"$f":"'3 Staffing-Employee & Contract'!B10","v":4},{"$f":"IF('3 Staffing-Employee & Contract'!D10<>0,'3 Staffing-Employee & Contract'!D10,\"\")","v":""},{"$f":"IF('3 Staffing-Employee & Contract'!Q10<>0,'3 Staffing-Employee & Contract'!Q10,\"\")","v":""},{"$f":"IF('3 Staffing-Employee & Contract'!E10<>0,'3 Staffing-Employee & Contract'!E10,\"\")","v":""}]
{"$rows_left_out":68}
{"sheet":"Admin Costs","index":8,"n_rows":13,"n_cols":5,"rows_kept":13,"cut":false,"hidden":false,"merged":[[6,0,6,1],[0,0,2,0],[0,1,0,2],[3,0,3,2],[2,1,2,2],[1,1,1,2],[4,0,4,1],[5,0,5,1],[7,0,7,1],[8,0,8,1],[10,0,10,1],[12,0,12,1],[11,0,11,2],[9,0,9,2]]}
[{"$f":"'1 Title Page'!A20","v":"[Organization Name]"},{"$f":"\"SNAP-Ed FY\"&'1 Title Page'!L1","v":"SNAP-Ed FY2023"},null,null,"This sheet will autofill based on data from other tabs"]
[null,"Administrative Costs"]
[]
[{"$f":"TODAY()","v":44619}]
[null,null,"Total"]
["SNAP-Ed Staffing - Program Administration",null,{"$f":"'3 Staffing-Employee & Contract'!V43+'3 Staffing-Employee & Contract'!V81","v":0},null,{"$f":"\"Based on completion of \"&'3 Staffing-Employee & Contract'!M5&\" on Staffing tab\"","v":"Based on completion of % Time spent on SNAP-Ed program admin on Staffing tab"}]
["Administrative / Space / Miscellaneous",null,{"$f":"'6 Admin-Space-Misc'!G17","v":0}]
["Indirect",null,{"$f":"'2 BUDGET SUMMARY'!F121+'2 BUDGET SUMMARY'!F122","v":0}]
["TOTAL ADMINISTRATIVE COSTS",null,{"$f":"SUM(C5:C8)","v":0}]
[]
{"$rows_left_out":4}
{"sheet":"PSE Costs","index":9,"n_rows":16,"n_cols":5,"rows_kept":16,"cut":false,"hidden":false,"merged":[[0,0,2,0],[0,1,0,2],[1,1,1,2],[2,1,2,2],[3,0,3,2],[11,0,11,1],[4,0,4,1],[13,0,13,2],[14,0,14,1],[15,0,15,1],[12,0,12,1],[6,0,6,1],[7,0,7,1],[5,0,5,1],[8,0,8,1],[9,0,9,1],[10,0,10,2]]}
[{"$f":"'1 Title Page'!A20","v":"[Organization Name]"},{"$f":"\"SNAP-Ed FY\"&'1 Title Page'!L1","v":"SNAP-Ed FY2023"},null,null,"This sheet will autofill based on data from other tabs"]
[null,"PSE Costs"]
[]
[{"$f":"TODAY()","v":44619}]
[null,null,"Total"]
["SNAP-Ed Staffing - PSE",null,{"$f":"'3 Staffing-Employee & Contract'!W43+'3 Staffing-Employee & Contract'!W81","v":0},null,{"$f":"\"Based on completion of \"&'3 Staffing-Employee & Contract'!N5&\" on Staffing tab\"","v":"Based on completion of % Time spent on SNAP-Ed PSE on Staffing tab"}]
["Program Expenses",null,{"$f":"'4 Program Expenses'!O32","v":0}]
["Travel",null,{"$f":"'5 Travel'!X40","v":0}]
["Administrative / Space / Miscellaneous",null,{"$f":"'6 Admin-Space-Misc'!O17","v":0}]
["TOTAL PSE COSTS",null,{"$f":"SUM(C5:C9)","v":0}]
{"$rows_left_out":7}
{"sheet":"Review Summary","index":10,"n_rows":124,"n_cols":18,"rows_kept":124,"cut":false,"hidden":true,"merged":[[119,1,119,7],[120,1,120,2],[122,1,122,7],[123,1,123,7],[121,1,121,3],[121,4,121,7],[120,4,120,6],[118,1,118,7],[107,1,107,7],[108,2,108,7],[109,2,109,7],[110,2,110,7],[111,2,111,7],[112,2,112,7],[113,2,113,7],[114,2,114,7],[115,2,115,7],[116,2,116,7],[117,2,117,7],[106,2,106,7],[95,2,95,7],[96,2,96,7],[97,2,97,7],[98,2,98,7],[99,2,99,7],[100,2,100,7],[101,2,101,7],[102,2,102,7],[103,2,103,7],[104,1,104,7],[105,2,105,7],[94,2,94,7],[83,2,83,7],[84,2,84,7],[85,2,85,7],[86,2,86,7],[87,2,87,7],[88,2,88,7],[89,2,89,7],[90,2,90,7],[91,2,91,7],[92,2,92,7],[93,2,93,7],[78,1,78,7],[79,2,79,7],[80,2,80,7],[81,2,81,7],[82,2,82,7],[42,1,42,7],[5,1,5,8],[6,1,6,2],[0,1,0,8],[1,1,1,8],[2,1,2,8],[3,1,3,8],[4,1,4,8]]}
["FILTER",{"$f":"'1 Title Page'!A20","v":"[Organization Name]"}]
["Y",{"$f":"\"FY\"&'1 Title Page'!L1&\" SNAP-Ed Budget Summary\"","v":"FY2023 SNAP-Ed Budget Summary"}]
["Y"]
["Y","This worksheet populates automatically when data is entered on subsequent tabs."]
["Y"]
["Y","SNAP-Ed Grant Award (CFDA #10.561)",null,null,null,null,null,null,null,null,null,null,null,null,null,null,null,"Decimal places for indirect rate"]
["Y","Salary and Fringe",null,"Title","Admin %","Hrs/Wk","Hrs/Mo","Notes",{"$f":"SUM(I8:I42)","v":0},null,{"$f":"'2 BUDGET SUMMARY'!F7","v":0}]
[{"$f":"IF(C8<>\"\",\"Y\",IF(I8<>0,\"Y\",\"N\"))","v":"N"},{"$f":"'2 BUDGET SUMMARY'!B8","v":1},{"$f":"'2 BUDGET SUMMARY'!C8","v":""},{"$f":"'Staff Admin & Pgm'!C8","v":""},{"$f":"'Staff Admin & Pgm'!E8","v":" "},{"$f":"IF(I8<>0,'3 Staffing-Employee & Contract'!Q7,\"\")","v":""},{"$f":"IF(F8<>\"\",ROUND(F8*4.3,1),\"\")","v":""},null,{"$f":"'2 BUDGET SUMMARY'!F8","v":0}]
["N",{"$f":"'2 BUDGET SUMMARY'!B9","v":2},{"$f":"'2 BUDGET SUMMARY'!C9","v":""},{"$f":"'Staff Admin & Pgm'!C9","v":""},{"$f":"'Staff Admin & Pgm'!E9","v":" "},{"$f":"IF(I9<>0,'3 Staffing-Employee & Contract'!Q8,\"\")","v":""},{"$f":"IF(F9<>\"\",ROUND(F9*4.3,1),\"\")","v":""},null,{"$f":"'2 BUDGET SUMMARY'!F9","v":0}]
["N",{"$f":"'2 BUDGET SUMMARY'!B10","v":3},{"$f":"'2 BUDGET SUMMARY'!C10","v":""},{"$f":"'Staff Admin & Pgm'!C10","v":""},{"$f":"'Staff Admin & Pgm'!E10","v":" "},{"$f":"IF(I10<>0,'3 Staffing-Employee & Contract'!Q9,\"\")","v":""},"",null,{"$f":"'2 BUDGET SUMMARY'!F10","v":0}]
{"$rows_left_out":114}